danharibo
23-03-2006 22:14:21
when i rty to compile i get errors like: tinyxml.h not found
and this:
Compiling...
SimpleVehicle.cpp
.\SimpleVehicle.cpp(91) : error C2039: 'destroyEntity' : is not a member of 'Ogre::SceneManager'
c:\program files\microsoft visual studio 8\vc\include\OgreSceneManager.h(77) : see declaration of 'Ogre::SceneManager'
.\SimpleVehicle.cpp(115) : error C2039: 'destroyEntity' : is not a member of 'Ogre::SceneManager'
c:\program files\microsoft visual studio 8\vc\include\OgreSceneManager.h(77) : see declaration of 'Ogre::SceneManager'
Build log was saved at "file://c:\OgreNewt\demos\Demo05_SimpleVehicle\Build\Release\BuildLog.htm"
Demo05_SimpleVehicle - 2 error(s), 0 warning(s)
========== Build: 0 succeeded, 1 failed, 1 up-to-date, 0 skipped ==========
and this:
Compiling...
SimpleVehicle.cpp
.\SimpleVehicle.cpp(91) : error C2039: 'destroyEntity' : is not a member of 'Ogre::SceneManager'
c:\program files\microsoft visual studio 8\vc\include\OgreSceneManager.h(77) : see declaration of 'Ogre::SceneManager'
.\SimpleVehicle.cpp(115) : error C2039: 'destroyEntity' : is not a member of 'Ogre::SceneManager'
c:\program files\microsoft visual studio 8\vc\include\OgreSceneManager.h(77) : see declaration of 'Ogre::SceneManager'
Build log was saved at "file://c:\OgreNewt\demos\Demo05_SimpleVehicle\Build\Release\BuildLog.htm"
Demo05_SimpleVehicle - 2 error(s), 0 warning(s)
========== Build: 0 succeeded, 1 failed, 1 up-to-date, 0 skipped ==========